Reaction Details
TargetHistidine-rich protein PFHRP-II
LigandBDBM50003681
Substrate/Competitorn/a
Meas. Tech.ChEMBL_500704 (CHEMBL966920)
IC50 26000±n/a nM
Citation Sunduru, NSrivastava, KRajakumar, SPuri, SKSaxena, JKChauhan, PM Synthesis of novel thiourea, thiazolidinedione and thioparabanic acid derivatives of 4-aminoquinoline as potent antimalarials. Bioorg Med Chem Lett19:2570-3 (2009) 
 
Histidine-rich protein PFHRP-II
Name:Histidine-rich protein PFHRP-II
Type:PROTEIN
Mol. Mass.:35156.49
Organism:Plasmodium falciparum
Description:ChEMBL_500704
Residue:332
BDBM50003681
NameBDBM50003681
Synonyms:CHEMBL468137
TypeSmall organic molecule
Emp. Form.C20H15ClN4O2S
Mol. Mass.410.877
SMILESClc1ccc2c(NCCN3C(=S)N(C(=O)C3=O)c3ccccc3)ccnc2c1