Reaction Details
TargetHistidine-rich protein PFHRP-II
LigandBDBM50003687
Substrate/Competitorn/a
Meas. Tech.ChEMBL_500704 (CHEMBL966920)
IC50 31200±n/a nM
Citation Sunduru, NSrivastava, KRajakumar, SPuri, SKSaxena, JKChauhan, PM Synthesis of novel thiourea, thiazolidinedione and thioparabanic acid derivatives of 4-aminoquinoline as potent antimalarials. Bioorg Med Chem Lett19:2570-3 (2009) 
 
Histidine-rich protein PFHRP-II
Name:Histidine-rich protein PFHRP-II
Type:PROTEIN
Mol. Mass.:35156.49
Organism:Plasmodium falciparum
Description:ChEMBL_500704
Residue:332
BDBM50003687
NameBDBM50003687
Synonyms:CHEMBL466027
TypeSmall organic molecule
Emp. Form.C18H17ClN4O2S
Mol. Mass.388.871
SMILESClc1ccc2c(NCCCN3C(=O)C(=O)N(CC=C)C3=S)ccnc2c1