Reaction Details
TargetSolute carrier family 22 member 2
LigandBDBM50367247
Substrate/Competitorn/a
Meas. Tech.ChEMBL_836107 (CHEMBL2077543)
IC50 13000±n/a nM
Citation Goralski, KBLou, GProwse, MTGorboulev, VVolk, CKoepsell, HSitar, DS The cation transporters rOCT1 and rOCT2 interact with bicarbonate but play only a minor role for amantadine uptake into rat renal proximal tubules. J Pharmacol Exp Ther303:959-68 (2002) 
 
Solute carrier family 22 member 2
Name:Solute carrier family 22 member 2
Type:Enzyme Catalytic Domain
Mol. Mass.:62348.38
Organism:RAT
Description:Adrenaline alpha2 0 RAT::Q9R0W2
Residue:555
BDBM50367247
NameBDBM50367247
Synonyms:QUININE Quinsan | cid_3034034
TypeSmall organic molecule
Emp. Form.C20H24N2O2
Mol. Mass.324.4168
SMILESCOc1ccc2nccc([C@@H](O)[C@@H]3C[C@@H]4CCN3C[C@@H]4C=C)c2c1