Reaction Details
TargetAcetolactate synthase 2, chloroplastic
LigandBDBM50004706
Substrate/Competitorn/a
Meas. Tech.ChEMBL_916416 (CHEMBL3082457)
IC50 16500±n/a nM
Citation Namgoong, SKLee, HJKim, YSShin, JHChe, JKJang, DYKim, GSYoo, JWKang, MKKil, MWChoi, JDChang, SI Synthesis of the quinoline-linked triazolopyrimidine analogues and their interactions with the recombinant tobacco acetolactate synthase. Biochem Biophys Res Commun258:797-801 (1999) 
 
Acetolactate synthase 2, chloroplastic
Name:Acetolactate synthase 2, chloroplastic
Type:PROTEIN
Mol. Mass.:72423.23
Organism:Nicotiana tabacum
Description:ChEMBL_106559
Residue:664
BDBM50004706
NameBDBM50004706
Synonyms:CHEMBL2269029
TypeSmall organic molecule
Emp. Form.C15H11FN6O2S
Mol. Mass.358.35
SMILESCc1ccn2nc(nc2n1)S(=O)(=O)Nc1c(F)ccc2cccnc12