Reaction Details
TargetAcetolactate synthase 2, chloroplastic
LigandBDBM50004707
Substrate/Competitorn/a
Meas. Tech.ChEMBL_916417 (CHEMBL3082458)
IC50 7.7±n/a nM
Citation Namgoong, SKLee, HJKim, YSShin, JHChe, JKJang, DYKim, GSYoo, JWKang, MKKil, MWChoi, JDChang, SI Synthesis of the quinoline-linked triazolopyrimidine analogues and their interactions with the recombinant tobacco acetolactate synthase. Biochem Biophys Res Commun258:797-801 (1999) 
 
Acetolactate synthase 2, chloroplastic
Name:Acetolactate synthase 2, chloroplastic
Type:PROTEIN
Mol. Mass.:72423.23
Organism:Nicotiana tabacum
Description:ChEMBL_106559
Residue:664
BDBM50004707
NameBDBM50004707
Synonyms:CHEMBL2269035
TypeSmall organic molecule
Emp. Form.C16H13FN6O2S
Mol. Mass.372.377
SMILESCc1cc(C)n2nc(nc2n1)S(=O)(=O)Nc1c(F)ccc2cccnc12