Reaction Details
TargetPeroxisome proliferator-activated receptor gamma
LigandBDBM50004753
Substrate/Competitorn/a
Meas. Tech.ChEMBL_922064 (CHEMBL3077606)
EC50 0.10±n/a nM
Citation  TBA Med Chem Res22:287-302 (2013)    Article
 
Peroxisome proliferator-activated receptor gamma
Name:Peroxisome proliferator-activated receptor gamma
Type:Nuclear Receptor
Mol. Mass.:57613.46
Organism:Homo sapiens (Human)
Description:P37231
Residue:505
BDBM50004753
NameBDBM50004753
Synonyms:CHEMBL2282517
TypeSmall organic molecule
Emp. Form.C34H29NO5S
Mol. Mass.563.663
SMILESCc1sc(nc1CCOc1ccc(C[C@@](O)(C(O)=O)c2ccccc2C(=O)c2ccccc2)cc1)-c1ccccc1