Reaction Details
TargetPeroxisome proliferator-activated receptor gamma
LigandBDBM50004754
Substrate/Competitorn/a
Meas. Tech.ChEMBL_922064 (CHEMBL3077606)
EC50 0.34±n/a nM
Citation  TBA Med Chem Res22:287-302 (2013)    Article
 
Peroxisome proliferator-activated receptor gamma
Name:Peroxisome proliferator-activated receptor gamma
Type:Nuclear Receptor
Mol. Mass.:57613.46
Organism:Homo sapiens (Human)
Description:P37231
Residue:505
BDBM50004754
NameBDBM50004754
Synonyms:CHEMBL2282523
TypeSmall organic molecule
Emp. Form.C34H29NO6
Mol. Mass.547.5972
SMILESCc1oc(nc1CCOc1ccc(C[C@@](O)(C(O)=O)c2ccccc2C(=O)c2ccccc2)cc1)-c1ccccc1