Reaction Details
Target5-hydroxytryptamine receptor 1A
LigandBDBM50412783
Substrate/Competitorn/a
Meas. Tech.ChEMBL_936352 (CHEMBL2321535)
Ki 0.60±n/a nM
Citation Bonifazi, APiergentili, ADel Bello, FFarande, YGiannella, MPigini, MAmantini, CNabissi, MFarfariello, VSantoni, GPoggesi, ELeonardi, AMenegon, SQuaglia, W Structure-activity relationships in 1,4-benzodioxan-related compounds. 11. (1) reversed enantioselectivity of 1,4-dioxane derivatives ina1-adrenergic and 5-HT1A receptor binding sites recognition. J Med Chem56:584-8 (2013) 
 
5-hydroxytryptamine receptor 1A
Name:5-hydroxytryptamine receptor 1A
Type:n/a
Mol. Mass.:46122.49
Organism:Homo sapiens (Human)
Description:n/a
Residue:422
BDBM50412783
NameBDBM50412783
Synonyms:CHEMBL493486
TypeSmall organic molecule
Emp. Form.C26H29NO4
Mol. Mass.419.5128
SMILESCOc1ccccc1OCCNC[C@@H]1COCC(O1)(c1ccccc1)c1ccccc1