Reaction Details
TargetCarbonic anhydrase 1
LigandBDBM10865
Substrate/Competitorn/a
Meas. Tech.ChEMBL_956004 (CHEMBL2380061)
Ki 6000±n/a nM
Citation Vullo, DLuca, VDScozzafava, ACarginale, VRossi, MSupuran, CTCapasso, C The alpha-carbonic anhydrase from the thermophilic bacterium Sulfurihydrogenibium yellowstonense YO3AOP1 is highly susceptible to inhibition by sulfonamides. Bioorg Med Chem21:1534-8 (2013) 
 
Carbonic anhydrase 1
Name:Carbonic anhydrase 1
Type:Enzyme
Mol. Mass.:28873.37
Organism:Homo sapiens (Human)
Description:P00915
Residue:261
BDBM10865
NameBDBM10865
Synonyms:4-Amino-3-iodobenzenesulfonamide CHEMBL268177 halogenosulfanilamide deriv. 5e
TypeSmall organic molecule
Emp. Form.C6H7IN2O2S
Mol. Mass.298.101
SMILESNc1ccc(cc1I)S(N)(=O)=O