Reaction Details
Target5-hydroxytryptamine receptor 7
LigandBDBM50001888
Substrate/Competitorn/a
Meas. Tech.ChEMBL_957879 (CHEMBL2378992)
Ki 11±n/a nM
Citation Kim, YKim, JTae, JRoth, BLRhim, HKeum, GNam, GChoo, H Discovery of aryl-biphenyl-2-ylmethylpiperazines as novel scaffolds for 5-HT(7) ligands and role of the aromatic substituents in binding to the target receptor. Bioorg Med Chem21:2568-76 (2013) 
 
5-hydroxytryptamine receptor 7
Name:5-hydroxytryptamine receptor 7
Type:G Protein-Coupled Receptor (GPCR)
Mol. Mass.:53573.08
Organism:Homo sapiens (Human)
Description:P34969
Residue:479
BDBM50001888
NameBDBM50001888
Synonyms:(chloropromazine) [3-(2-Chloro-phenothiazin-10-yl)-propyl]-dimethyl-amine 1-(2-Allyl-phenoxy)-3-isopropylamino-propan-2-ol 3-(2-chloro-10H-phenothiazin-10-yl)-N,N-dimethylpropan-1-amine CHLORPROMAZINE CHLORPROMAZINE HYDROCHLORIDE CHLORPROMAZINE TANNATE PROMAPAR THORAZINE [3-(2-Chloro-phenothiazin-10-yl)-propyl]-dimethyl-amine( Chlorpromazine) chloropromazine | med.21724, Compound 15
TypeSmall organic molecule
Emp. Form.C17H19ClN2S
Mol. Mass.318.864
SMILESCN(C)CCCN1c2ccccc2Sc2ccc(Cl)cc12