Reaction Details
TargetCarbonic anhydrase 2
LigandBDBM50004942
Substrate/Competitorn/a
Meas. Tech.ChEMBL_960000 (CHEMBL2384053)
Ki 74±n/a nM
Citation Carta, FAkdemir, AScozzafava, AMasini, ESupuran, CT Xanthates and trithiocarbonates strongly inhibit carbonic anhydrases and show antiglaucoma effects in vivo. J Med Chem56:4691-700 (2013) 
 
Carbonic anhydrase 2
Name:Carbonic anhydrase 2
Type:Enzyme
Mol. Mass.:29250.71
Organism:Homo sapiens (Human)
Description:P00918
Residue:260
BDBM50004942
NameBDBM50004942
Synonyms:CHEMBL2380755
TypeSmall organic molecule
Emp. Form.C2HKN2S2
Mol. Mass.156.271
SMILES[K+].[S-]C(=S)NC#N