Reaction Details
TargetCarbonic anhydrase 2
LigandBDBM50373123
Substrate/Competitorn/a
Meas. Tech.ChEMBL_960000 (CHEMBL2384053)
Ki 6.6±n/a nM
Citation Carta, FAkdemir, AScozzafava, AMasini, ESupuran, CT Xanthates and trithiocarbonates strongly inhibit carbonic anhydrases and show antiglaucoma effects in vivo. J Med Chem56:4691-700 (2013) 
 
Carbonic anhydrase 2
Name:Carbonic anhydrase 2
Type:Enzyme
Mol. Mass.:29250.71
Organism:Homo sapiens (Human)
Description:P00918
Residue:260
BDBM50373123
NameBDBM50373123
Synonyms:CHEMBL404954
TypeSmall organic molecule
Emp. Form.C11H15OS2
Mol. Mass.227.367
SMILES[S-]C(=S)OC1CC2CC1C1CCCC21