Reaction Details
TargetCarbonic anhydrase 2
LigandBDBM50004931
Substrate/Competitorn/a
Meas. Tech.ChEMBL_960000 (CHEMBL2384053)
Ki 8.1±n/a nM
Citation Carta, FAkdemir, AScozzafava, AMasini, ESupuran, CT Xanthates and trithiocarbonates strongly inhibit carbonic anhydrases and show antiglaucoma effects in vivo. J Med Chem56:4691-700 (2013) 
 
Carbonic anhydrase 2
Name:Carbonic anhydrase 2
Type:Enzyme
Mol. Mass.:29250.71
Organism:Homo sapiens (Human)
Description:P00918
Residue:260
BDBM50004931
NameBDBM50004931
Synonyms:CHEMBL2380746
TypeSmall organic molecule
Emp. Form.C7H14KNO2S2
Mol. Mass.247.42
SMILES[K+].CN(C)CCOCCOC([S-])=S