Reaction Details
TargetCarbonic anhydrase 2
LigandBDBM50004932
Substrate/Competitorn/a
Meas. Tech.ChEMBL_960000 (CHEMBL2384053)
Ki 60±n/a nM
Citation Carta, FAkdemir, AScozzafava, AMasini, ESupuran, CT Xanthates and trithiocarbonates strongly inhibit carbonic anhydrases and show antiglaucoma effects in vivo. J Med Chem56:4691-700 (2013) 
 
Carbonic anhydrase 2
Name:Carbonic anhydrase 2
Type:Enzyme
Mol. Mass.:29250.71
Organism:Homo sapiens (Human)
Description:P00918
Residue:260
BDBM50004932
NameBDBM50004932
Synonyms:CHEMBL2380745
TypeSmall organic molecule
Emp. Form.C5H10KNOS2
Mol. Mass.203.367
SMILES[K+].CN(C)CCOC([S-])=S