Reaction Details
TargetCarbonic anhydrase 2
LigandBDBM50004936
Substrate/Competitorn/a
Meas. Tech.ChEMBL_960000 (CHEMBL2384053)
Ki 361±n/a nM
Citation Carta, FAkdemir, AScozzafava, AMasini, ESupuran, CT Xanthates and trithiocarbonates strongly inhibit carbonic anhydrases and show antiglaucoma effects in vivo. J Med Chem56:4691-700 (2013) 
 
Carbonic anhydrase 2
Name:Carbonic anhydrase 2
Type:Enzyme
Mol. Mass.:29250.71
Organism:Homo sapiens (Human)
Description:P00918
Residue:260
BDBM50004936
NameBDBM50004936
Synonyms:CHEMBL2380741
TypeSmall organic molecule
Emp. Form.C6H11KOS2
Mol. Mass.202.379
SMILES[K+].CCCCCOC([S-])=S