Reaction Details
TargetCarbonic anhydrase 1
LigandBDBM50373123
Substrate/Competitorn/a
Meas. Tech.ChEMBL_960001 (CHEMBL2384054)
Ki 63±n/a nM
Citation Carta, FAkdemir, AScozzafava, AMasini, ESupuran, CT Xanthates and trithiocarbonates strongly inhibit carbonic anhydrases and show antiglaucoma effects in vivo. J Med Chem56:4691-700 (2013) 
 
Carbonic anhydrase 1
Name:Carbonic anhydrase 1
Type:Enzyme
Mol. Mass.:28873.37
Organism:Homo sapiens (Human)
Description:P00915
Residue:261
BDBM50373123
NameBDBM50373123
Synonyms:CHEMBL404954
TypeSmall organic molecule
Emp. Form.C11H15OS2
Mol. Mass.227.367
SMILES[S-]C(=S)OC1CC2CC1C1CCCC21