Reaction Details
TargetCarbonic anhydrase 1
LigandBDBM50004941
Substrate/Competitorn/a
Meas. Tech.ChEMBL_960001 (CHEMBL2384054)
Ki 687±n/a nM
Citation Carta, FAkdemir, AScozzafava, AMasini, ESupuran, CT Xanthates and trithiocarbonates strongly inhibit carbonic anhydrases and show antiglaucoma effects in vivo. J Med Chem56:4691-700 (2013) 
 
Carbonic anhydrase 1
Name:Carbonic anhydrase 1
Type:Enzyme
Mol. Mass.:28873.37
Organism:Homo sapiens (Human)
Description:P00915
Residue:261
BDBM50004941
NameBDBM50004941
Synonyms:CHEMBL2380737
TypeSmall organic molecule
Emp. Form.C2H3KOS2
Mol. Mass.146.273
SMILES[K+].COC([S-])=S