Reaction Details
TargetCarbonic anhydrase 12
LigandBDBM50004943
Substrate/Competitorn/a
Meas. Tech.ChEMBL_959998 (CHEMBL2384051)
Ki 6.7±n/a nM
Citation Carta, FAkdemir, AScozzafava, AMasini, ESupuran, CT Xanthates and trithiocarbonates strongly inhibit carbonic anhydrases and show antiglaucoma effects in vivo. J Med Chem56:4691-700 (2013) 
 
Carbonic anhydrase 12
Name:Carbonic anhydrase 12
Type:Enzyme
Mol. Mass.:39456.00
Organism:Homo sapiens (Human)
Description:Catalytic domain of human cloned isozyme was used in the assay
Residue:354
BDBM50004943
NameBDBM50004943
Synonyms:CHEMBL2380754
TypeSmall organic molecule
Emp. Form.C8H7KS3
Mol. Mass.238.434
SMILES[K+].[S-]C(=S)SCc1ccccc1