Reaction Details
TargetCarbonic anhydrase 12
LigandBDBM50004933
Substrate/Competitorn/a
Meas. Tech.ChEMBL_959998 (CHEMBL2384051)
Ki 76±n/a nM
Citation Carta, FAkdemir, AScozzafava, AMasini, ESupuran, CT Xanthates and trithiocarbonates strongly inhibit carbonic anhydrases and show antiglaucoma effects in vivo. J Med Chem56:4691-700 (2013) 
 
Carbonic anhydrase 12
Name:Carbonic anhydrase 12
Type:Enzyme
Mol. Mass.:39456.00
Organism:Homo sapiens (Human)
Description:Catalytic domain of human cloned isozyme was used in the assay
Residue:354
BDBM50004933
NameBDBM50004933
Synonyms:CHEMBL2380744
TypeSmall organic molecule
Emp. Form.C7H11KOS2
Mol. Mass.214.39
SMILES[K+].[S-]C(=S)OC1CCCCC1