Reaction Details
TargetCarbonic anhydrase 12
LigandBDBM50004936
Substrate/Competitorn/a
Meas. Tech.ChEMBL_959998 (CHEMBL2384051)
Ki 766±n/a nM
Citation Carta, FAkdemir, AScozzafava, AMasini, ESupuran, CT Xanthates and trithiocarbonates strongly inhibit carbonic anhydrases and show antiglaucoma effects in vivo. J Med Chem56:4691-700 (2013) 
 
Carbonic anhydrase 12
Name:Carbonic anhydrase 12
Type:Enzyme
Mol. Mass.:39456.00
Organism:Homo sapiens (Human)
Description:Catalytic domain of human cloned isozyme was used in the assay
Residue:354
BDBM50004936
NameBDBM50004936
Synonyms:CHEMBL2380741
TypeSmall organic molecule
Emp. Form.C6H11KOS2
Mol. Mass.202.379
SMILES[K+].CCCCCOC([S-])=S