Reaction Details
TargetCarbonic anhydrase 9
LigandBDBM50004954
Substrate/Competitorn/a
Meas. Tech.ChEMBL_965224 (CHEMBL2394009)
IC50 199±n/a nM
Citation Wang, LYang, CLu, WLiu, LGao, RLiao, SZhao, ZZhu, LXu, YLi, HHuang, JZhu, W Discovery of new potent inhibitors for carbonic anhydrase IX by structure-based virtual screening. Bioorg Med Chem Lett23:3496-9 (2013) 
 
Carbonic anhydrase 9
Name:Carbonic anhydrase 9
Type:Enzyme
Mol. Mass.:49669.03
Organism:Homo sapiens (Human)
Description:Catalytic domain of human cloned isozyme was used in the assay
Residue:459
BDBM50004954
NameBDBM50004954
Synonyms:CHEMBL2392432
TypeSmall organic molecule
Emp. Form.C17H16BrN3O4S
Mol. Mass.438.296
SMILESNS(=O)(=O)c1ccc(CNC2CC(=O)N(C2=O)c2cccc(Br)c2)cc1