Reaction Details
TargetCarbonic anhydrase 9
LigandBDBM50004998
Substrate/Competitorn/a
Meas. Tech.ChEMBL_965224 (CHEMBL2394009)
IC50 15±n/a nM
Citation Wang, LYang, CLu, WLiu, LGao, RLiao, SZhao, ZZhu, LXu, YLi, HHuang, JZhu, W Discovery of new potent inhibitors for carbonic anhydrase IX by structure-based virtual screening. Bioorg Med Chem Lett23:3496-9 (2013) 
 
Carbonic anhydrase 9
Name:Carbonic anhydrase 9
Type:Enzyme
Mol. Mass.:49669.03
Organism:Homo sapiens (Human)
Description:Catalytic domain of human cloned isozyme was used in the assay
Residue:459
BDBM50004998
NameBDBM50004998
Synonyms:CHEMBL2392426
TypeSmall organic molecule
Emp. Form.C21H18N4O4S
Mol. Mass.422.457
SMILESCc1ccc(cc1)N1NC(=O)\C(=C\c2cccn2-c2ccc(cc2)S(N)(=O)=O)C1=O