Reaction Details
TargetProthrombin
LigandBDBM23416
Substrate/Competitorn/a
Meas. Tech.ChEMBL_982099 (CHEMBL2428686)
Kd 49200±n/a nM
Citation Bijak, MZiewiecki, RSaluk, JPonczek, MPawlaczyk, IKrotkiewski, HWachowicz, BNowak, P Thrombin inhibitory activity of some polyphenolic compounds. Med Chem Res23:2324-2337 (2014) 
 
Prothrombin
Name:Prothrombin
Type:Protein
Mol. Mass.:70029.57
Organism:Homo sapiens (Human)
Description:P00734
Residue:622
BDBM23416
NameBDBM23416
Synonyms:α-CA inhibitor, 3 (2R,3S)-2-(3,4-dihydroxyphenyl)-3,4-dihydro-2H-1-benzopyran-3,5,7-triol Catechin | D-Catechin
TypeFlavonol
Emp. Form.C15H14O6
Mol. Mass.290.2681
SMILESO[C@H]1Cc2c(O)cc(O)cc2O[C@@H]1c1ccc(O)c(O)c1