Reaction Details
TargetProthrombin
LigandBDBM50241503
Substrate/Competitorn/a
Meas. Tech.ChEMBL_982099 (CHEMBL2428686)
Kd 7.8±n/a nM
Citation Bijak, MZiewiecki, RSaluk, JPonczek, MPawlaczyk, IKrotkiewski, HWachowicz, BNowak, P Thrombin inhibitory activity of some polyphenolic compounds. Med Chem Res23:2324-2337 (2014) 
 
Prothrombin
Name:Prothrombin
Type:Protein
Mol. Mass.:70029.57
Organism:Homo sapiens (Human)
Description:P00734
Residue:622
BDBM50241503
NameBDBM50241503
Synonyms:2-(3,4-Dihydroxyphenyl)-3,5,7-trihydroxy-1-Benzopyrylium 3,3',4',5,7-pentahydroxyflavylium CHEMBL404515 Cyanidin | cyanidin(1+)
TypeSmall organic molecule
Emp. Form.C15H11O6
Mol. Mass.287.2437
SMILESOc1cc2oc(c(O)cc2c(=[OH+])c1)-c1ccc(O)c(O)c1