Reaction Details
TargetAcetylcholinesterase
LigandBDBM50005115
Substrate/Competitorn/a
Meas. Tech.ChEMBL_1278101 (CHEMBL3095599)
Ki 400±n/a nM
Citation Komloova, MHorova, AHrabinova, MJun, DDolezal, MVinsova, JKuca, KMusilek, K Preparation, in vitro evaluation and molecular modelling of pyridinium-quinolinium/isoquinolinium non-symmetrical bisquaternary cholinesterase inhibitors. Bioorg Med Chem Lett23:6663-6 (2013) 
 
Acetylcholinesterase
Name:Acetylcholinesterase
Type:Enzyme
Mol. Mass.:67792.70
Organism:Homo sapiens (Human)
Description:P22303
Residue:614
BDBM50005115
NameBDBM50005115
Synonyms:CHEMBL3093802
TypeSmall organic molecule
Emp. Form.C24H32Br2N2
Mol. Mass.508.332
SMILES[Br-].[Br-].C(CCCCC[n+]1cccc2ccccc12)CCCC[n+]1ccccc1