Reaction Details
TargetAcetylcholinesterase
LigandBDBM50005114
Substrate/Competitorn/a
Meas. Tech.ChEMBL_1278103 (CHEMBL3095601)
Ki 10.0±n/a nM
Citation Komloova, MHorova, AHrabinova, MJun, DDolezal, MVinsova, JKuca, KMusilek, K Preparation, in vitro evaluation and molecular modelling of pyridinium-quinolinium/isoquinolinium non-symmetrical bisquaternary cholinesterase inhibitors. Bioorg Med Chem Lett23:6663-6 (2013) 
 
Acetylcholinesterase
Name:Acetylcholinesterase
Type:Enzyme
Mol. Mass.:67792.70
Organism:Homo sapiens (Human)
Description:P22303
Residue:614
BDBM50005114
NameBDBM50005114
Synonyms:CHEMBL3093804
TypeSmall organic molecule
Emp. Form.C26H36Br2N2
Mol. Mass.536.385
SMILES[Br-].[Br-].C(CCCCCC[n+]1cccc2ccccc12)CCCCC[n+]1ccccc1