Reaction Details
TargetCholinesterase
LigandBDBM120262
Substrate/Competitorn/a
Meas. Tech.ChEMBL_1278105 (CHEMBL3095603)
IC50 1370000±n/a nM
Citation Komloova, MHorova, AHrabinova, MJun, DDolezal, MVinsova, JKuca, KMusilek, K Preparation, in vitro evaluation and molecular modelling of pyridinium-quinolinium/isoquinolinium non-symmetrical bisquaternary cholinesterase inhibitors. Bioorg Med Chem Lett23:6663-6 (2013) 
 
Cholinesterase
Name:Cholinesterase
Type:Homotetramer
Mol. Mass.:68422.27
Organism:Homo sapiens (Human)
Description:P06276
Residue:602
BDBM120262
NameBDBM120262
Synonyms:EDROPHONIUM BROMIDE Edrophonium cid_8307
TypeSmall organic molecule
Emp. Form.C10H16NO
Mol. Mass.166.2396
SMILESCC[N+](C)(C)c1cccc(O)c1