Reaction Details
TargetCholinesterase
LigandBDBM50005192
Substrate/Competitorn/a
Meas. Tech.ChEMBL_1281568 (CHEMBL3102253)
Ki 8.3±n/a nM
Citation Butini, SBrindisi, MBrogi, SMaramai, SGuarino, EPanico, ASaxena, AChauhan, VColombo, RVerga, LDe Lorenzi, EBartolini, MAndrisano, VNovellino, ECampiani, GGemma, S Multifunctional cholinesterase and amyloid Beta fibrillization modulators. Synthesis and biological investigation. ACS Med Chem Lett4:1178-82 (2013) 
 
Cholinesterase
Name:Cholinesterase
Type:Homotetramer
Mol. Mass.:68422.27
Organism:Homo sapiens (Human)
Description:P06276
Residue:602
BDBM50005192
NameBDBM50005192
Synonyms:CHEMBL3099497
TypeSmall organic molecule
Emp. Form.C34H43N5
Mol. Mass.521.7387
SMILESNc1cccc2c(NCCCCCCCCNc3c4CCCCc4nc4ccccc34)c3CCCCc3nc12