Reaction Details
TargetAcetylcholinesterase
LigandBDBM50005193
Substrate/Competitorn/a
Meas. Tech.ChEMBL_1281569 (CHEMBL3102254)
Ki 0.78±n/a nM
Citation Butini, SBrindisi, MBrogi, SMaramai, SGuarino, EPanico, ASaxena, AChauhan, VColombo, RVerga, LDe Lorenzi, EBartolini, MAndrisano, VNovellino, ECampiani, GGemma, S Multifunctional cholinesterase and amyloid Beta fibrillization modulators. Synthesis and biological investigation. ACS Med Chem Lett4:1178-82 (2013) 
 
Acetylcholinesterase
Name:Acetylcholinesterase
Type:Enzyme
Mol. Mass.:67792.70
Organism:Homo sapiens (Human)
Description:P22303
Residue:614
BDBM50005193
NameBDBM50005193
Synonyms:CHEMBL3099496
TypeSmall organic molecule
Emp. Form.C34H41N5O2
Mol. Mass.551.7216
SMILES[O-][N+](=O)c1cccc2c(NCCCCCCCCNc3c4CCCCc4nc4ccccc34)c3CCCCc3nc12