Reaction Details
TargetCannabinoid receptor 1
LigandBDBM50005271
Substrate/Competitorn/a
Meas. Tech.ChEMBL_1291356 (CHEMBL3117772)
EC50>17000±n/a nM
Citation Nanda, KKHenze, DADella Penna, KDesai, RLeitl, MLemaire, WWhite, RBYeh, SBrouillette, JNHartman, GDBilodeau, MTTrotter, BW Benzimidazole CB2 agonists: design, synthesis and SAR. Bioorg Med Chem Lett24:1218-21 (2014) 
 
Cannabinoid receptor 1
Name:Cannabinoid receptor 1
Type:G Protein-Coupled Receptor (GPCR)
Mol. Mass.:52868.96
Organism:Homo sapiens (Human)
Description:P21554
Residue:472
BDBM50005271
NameBDBM50005271
Synonyms:CHEMBL3114523
TypeSmall organic molecule
Emp. Form.C21H19N5O
Mol. Mass.357.4085
SMILESCCn1c(nc2c(cccc12)-c1ccccc1)C(=O)NCc1cncnc1