Reaction Details
TargetCannabinoid receptor 2
LigandBDBM50005283
Substrate/Competitorn/a
Meas. Tech.ChEMBL_1291359 (CHEMBL3117775)
EC50>17000±n/a nM
Citation Nanda, KKHenze, DADella Penna, KDesai, RLeitl, MLemaire, WWhite, RBYeh, SBrouillette, JNHartman, GDBilodeau, MTTrotter, BW Benzimidazole CB2 agonists: design, synthesis and SAR. Bioorg Med Chem Lett24:1218-21 (2014) 
 
Cannabinoid receptor 2
Name:Cannabinoid receptor 2
Type:G Protein-Coupled Receptor (GPCR)
Mol. Mass.:39690.94
Organism:Homo sapiens (Human)
Description:P34972
Residue:360
BDBM50005283
NameBDBM50005283
Synonyms:CHEMBL3114533
TypeSmall organic molecule
Emp. Form.C23H24F3N3O2
Mol. Mass.431.4508
SMILESOCC1(CNC(=O)c2nc3c(cccc3n2CC(F)(F)F)-c2ccccc2)CCCC1