Reaction Details
TargetCannabinoid receptor 2
LigandBDBM50005287
Substrate/Competitorn/a
Meas. Tech.ChEMBL_1291359 (CHEMBL3117775)
EC50 490±n/a nM
Citation Nanda, KKHenze, DADella Penna, KDesai, RLeitl, MLemaire, WWhite, RBYeh, SBrouillette, JNHartman, GDBilodeau, MTTrotter, BW Benzimidazole CB2 agonists: design, synthesis and SAR. Bioorg Med Chem Lett24:1218-21 (2014) 
 
Cannabinoid receptor 2
Name:Cannabinoid receptor 2
Type:G Protein-Coupled Receptor (GPCR)
Mol. Mass.:39690.94
Organism:Homo sapiens (Human)
Description:P34972
Residue:360
BDBM50005287
NameBDBM50005287
Synonyms:CHEMBL3114530
TypeSmall organic molecule
Emp. Form.C21H25N3O
Mol. Mass.335.4427
SMILESCCn1c(nc2c(cccc12)-c1ccccc1)C(=O)NCC(C)(C)C