Reaction Details
TargetCannabinoid receptor 1
LigandBDBM50005284
Substrate/Competitorn/a
Meas. Tech.ChEMBL_1291356 (CHEMBL3117772)
EC50>17000±n/a nM
Citation Nanda, KKHenze, DADella Penna, KDesai, RLeitl, MLemaire, WWhite, RBYeh, SBrouillette, JNHartman, GDBilodeau, MTTrotter, BW Benzimidazole CB2 agonists: design, synthesis and SAR. Bioorg Med Chem Lett24:1218-21 (2014) 
 
Cannabinoid receptor 1
Name:Cannabinoid receptor 1
Type:G Protein-Coupled Receptor (GPCR)
Mol. Mass.:52868.96
Organism:Homo sapiens (Human)
Description:P21554
Residue:472
BDBM50005284
NameBDBM50005284
Synonyms:CHEMBL3114532
TypeSmall organic molecule
Emp. Form.C21H22F3N3O
Mol. Mass.389.4141
SMILESCC(C)(C)CNC(=O)c1nc2c(cccc2n1CC(F)(F)F)-c1ccccc1