Reaction Details
TargetCannabinoid receptor 1
LigandBDBM50005288
Substrate/Competitorn/a
Meas. Tech.ChEMBL_1291356 (CHEMBL3117772)
EC50>17000±n/a nM
Citation Nanda, KKHenze, DADella Penna, KDesai, RLeitl, MLemaire, WWhite, RBYeh, SBrouillette, JNHartman, GDBilodeau, MTTrotter, BW Benzimidazole CB2 agonists: design, synthesis and SAR. Bioorg Med Chem Lett24:1218-21 (2014) 
 
Cannabinoid receptor 1
Name:Cannabinoid receptor 1
Type:G Protein-Coupled Receptor (GPCR)
Mol. Mass.:52868.96
Organism:Homo sapiens (Human)
Description:P21554
Residue:472
BDBM50005288
NameBDBM50005288
Synonyms:CHEMBL3114529
TypeSmall organic molecule
Emp. Form.C21H23N3O2
Mol. Mass.349.4262
SMILESOCC1(CCCCC1)NC(=O)c1nc2c(cccc2[nH]1)-c1ccccc1