Reaction Details
TargetThymidine kinase, cytosolic
LigandBDBM50000974
Substrate/Competitorn/a
Meas. Tech.ChEMBL_1333876 (CHEMBL3231765)
Ki 180000±n/a nM
Citation Hampton, AKappler, FChawla, RR Design of species- or isozyme-specific enzyme inhibitors. 1. Effect of thymidine substituents on affinity for the thymidine site of hamster cytoplasmic thymidine kinase. J Med Chem22:621-31 (1979) Thymidine kinase, cytosolic
Name:Thymidine kinase, cytosolic
Type:PROTEIN
Mol. Mass.:25628.94
Organism:Cricetulus griseus
Description:ChEMBL_108265
Residue:234
BDBM50000974
NameBDBM50000974
Synonyms:CHEMBL3229800
TypeSmall organic molecule
Emp. Form.C16H27N3O4
Mol. Mass.325.4033
SMILESCCCCCCNC[C@H]1O[C@H](C[C@@H]1O)n1cc(C)c(=O)[nH]c1=O