Reaction Details
TargetThymidine kinase, cytosolic
LigandBDBM50404860
Substrate/Competitorn/a
Meas. Tech.ChEMBL_1333889 (CHEMBL3231778)
Ki 24000±n/a nM
Citation Hampton, AKappler, FChawla, RR Design of species- or isozyme-specific enzyme inhibitors. 1. Effect of thymidine substituents on affinity for the thymidine site of hamster cytoplasmic thymidine kinase. J Med Chem22:621-31 (1979) Thymidine kinase, cytosolic
Name:Thymidine kinase, cytosolic
Type:PROTEIN
Mol. Mass.:25782.68
Organism:Mus musculus
Description:ChEMBL_12706
Residue:233
BDBM50404860
NameBDBM50404860
Synonyms:CHEMBL2111285
TypeSmall organic molecule
Emp. Form.C12H19BrN2O6
Mol. Mass.367.193
SMILESCCOC1N([C@H]2C[C@H](O)[C@@H](CO)O2)C(=O)NC(=O)C1(C)Br