Reaction Details
TargetOrexin receptor type 2
LigandBDBM104689
Substrate/Competitorn/a
Meas. Tech.ChEMBL_1337232 (CHEMBL3240640)
Ki 0.200000±n/a nM
Citation Kuduk, SDSkudlarek, JWDi Marco, CNBruno, JGPausch, MAO'Brien, JACabalu, TDStevens, JBrunner, JTannenbaum, PLGotter, ALWinrow, CJRenger, JJColeman, PJ Synthesis and evaluation of carbon-linked analogs of dual orexin receptor antagonist filorexant. Bioorg Med Chem Lett24:1784-9 (2014) 
 
Orexin receptor type 2
Name:Orexin receptor type 2
Type:Protein
Mol. Mass.:50710.53
Organism:Homo sapiens (Human)
Description:O43614
Residue:444
BDBM104689
NameBDBM104689
Synonyms:US8569311, A-9
TypeSmall organic molecule
Emp. Form.C22H24FN5O2
Mol. Mass.409.4567
SMILESC[C@@H]1CC[C@@H](COc2ccc(F)cn2)CN1C(=O)c1cc(C)ccc1-n1nccn1