Reaction Details
TargetOrexin receptor type 2
LigandBDBM50000985
Substrate/Competitorn/a
Meas. Tech.ChEMBL_1337232 (CHEMBL3240640)
Ki 1.1±n/a nM
Citation Kuduk, SDSkudlarek, JWDi Marco, CNBruno, JGPausch, MAO'Brien, JACabalu, TDStevens, JBrunner, JTannenbaum, PLGotter, ALWinrow, CJRenger, JJColeman, PJ Synthesis and evaluation of carbon-linked analogs of dual orexin receptor antagonist filorexant. Bioorg Med Chem Lett24:1784-9 (2014) 
 
Orexin receptor type 2
Name:Orexin receptor type 2
Type:Protein
Mol. Mass.:50710.53
Organism:Homo sapiens (Human)
Description:O43614
Residue:444
BDBM50000985
NameBDBM50000985
Synonyms:CHEMBL3235253
TypeSmall organic molecule
Emp. Form.C23H22FN5O
Mol. Mass.403.4521
SMILESC[C@@H]1CC[C@H](CN1C(=O)c1cc(C)ccc1-n1nccn1)C#Cc1ccc(F)cn1