Reaction Details
TargetPlasmepsin II
LigandBDBM50001071
Substrate/Competitorn/a
Meas. Tech.ChEMBL_1338068 (CHEMBL3241789)
Ki 2.3±n/a nM
Citation Miura, THidaka, KAzai, YKashimoto, KKawasaki, YChen, SEde Freitas, RFFreire, EKiso, Y Optimization of plasmepsin inhibitor by focusing on similar structural feature with chloroquine to avoid drug-resistant mechanism of Plasmodium falciparum. Bioorg Med Chem Lett24:1698-701 (2014) 
 
Plasmepsin II
Name:Plasmepsin II
Type:Enzyme
Mol. Mass.:51482.09
Organism:Plasmodium falciparum
Description:P46925
Residue:453
BDBM50001071
NameBDBM50001071
Synonyms:CHEMBL3236065
TypeSmall organic molecule
Emp. Form.C38H47N5O7S
Mol. Mass.717.874
SMILESCc1cc(NC(=O)CCN)cc(C)c1OCC(=O)N[C@@H](Cc1ccccc1)[C@H](O)C(=O)N1CSC(C)(C)[C@H]1C(=O)N[C@@H]1[C@H](O)Cc2ccccc12