Reaction Details
TargetProstaglandin G/H synthase 1
LigandBDBM50029593
Substrate/Competitorn/a
Meas. Tech.ChEMBL_1339751 (CHEMBL3243388)
IC50 213200±n/a nM
Citation Abdel-Aziz, MBeshr, EAAbdel-Rahman, IMOzadali, KTan, OUAly, OM 1-(4-Methoxyphenyl)-5-(3,4,5-trimethoxyphenyl)-1H-1,2,4-triazole-3-carboxamides: synthesis, molecular modeling, evaluation of their anti-inflammatory activity and ulcerogenicity. Eur J Med Chem77:155-65 (2014) 
 
Prostaglandin G/H synthase 1
Name:Prostaglandin G/H synthase 1
Type:Protein
Mol. Mass.:68868.60
Organism:Ovis aries (Sheep)
Description:n/a
Residue:600
BDBM50029593
NameBDBM50029593
Synonyms:CHEMBL7162 N-(2-Cyclohexyloxy-4-nitro-phenyl)-methanesulfonamide N-[2-(cyclohexyloxy)-4-nitrophenyl]methane sulfonamide N-{2-(cyclohexyloxy)-4-[hydroxy(oxido)amino]phenyl}methanesulfonamide NS398
TypeSmall organic molecule
Emp. Form.C13H18N2O5S
Mol. Mass.314.357
SMILESCS(=O)(=O)Nc1ccc(cc1OC1CCCCC1)[N+]([O-])=O