Reaction Details
TargetCyclin-dependent kinase 4/G1/S-specific cyclin-D1
LigandBDBM50001584
Substrate/Competitorn/a
Meas. Tech.ChEMBL_1336031 (CHEMBL3240324)
IC50 2.0±n/a nM
Citation Li, ZWang, XEksterowicz, JGribble, MWAlba, GQAyres, MCarlson, TJChen, AChen, XCho, RConnors, RVDeGraffenreid, MDeignan, JTDuquette, JFan, PFisher, BFu, JHuard, JNKaizerman, JKeegan, KSLi, CLi, KLi, YLiang, LLiu, WLively, SELo, MCMa, JMcMinn, DLMihalic, JTModi, KNgo, RPattabiraman, KPiper, DEQueva, CRagains, MLSuchomel, JThibault, SWalker, NWang, XWang, ZWanska, MWehn, PMWeidner, MFZhang, AJZhao, XKamb, AWickramasinghe, DDai, KMcGee, LRMedina, JC Discovery of AMG 925, a FLT3 and CDK4 dual kinase inhibitor with preferential affinity for the activated state of FLT3. J Med Chem57:3430-49 (2014) 
 
Cyclin-dependent kinase 4/G1/S-specific cyclin-D1
Name:Cyclin-dependent kinase 4/G1/S-specific cyclin-D1
Type:Protein Complex
Mol. Mass.:n/a
Description:CDK4/D1 complexes were purified from insect cells co-infected with baculovirus vectors containing each of the components.
Components:This complex has 2 components.
Component 1
Name:Cyclin-dependent kinase 4
Synonyms:CDK4 Cell division protein kinase 4 PSK-J3
Type:Enzyme Subunit
Mol. Mass.:33731.96
Organism:Homo sapiens (Human)
Description:P11802
Residue:303
Component 2
Name:G1/S-specific cyclin-D1
Synonyms:B-cell lymphoma 1 protein BCL-1 oncogene CCND1 PRAD1 | PRAD1 oncogene
Type:Enzyme Subunit
Mol. Mass.:33717.70
Organism:Homo sapiens (Human)
Description:n/a
Residue:295
BDBM50001584
NameBDBM50001584
Synonyms:CHEMBL3237442 | US8841312, 1
TypeSmall organic molecule
Emp. Form.C23H26N8
Mol. Mass.414.5061
SMILESC1CCC(C1)n1c2cnccc2c2cnc(Nc3ccc(cn3)N3CCNCC3)nc12