Reaction Details
TargetMu-type opioid receptor
LigandBDBM50001608
Substrate/Competitorn/a
Meas. Tech.ChEMBL_1336486 (CHEMBL3242763)
Ki 1.7±n/a nM
Citation Mosberg, HIYeomans, LAnand, JPPorter, VSobczyk-Kojiro, KTraynor, JRJutkiewicz, EM Development of a bioavailableµ opioid receptor (MOPr) agonist,d opioid receptor (DOPr) antagonist peptide that evokes antinociception without development of acute tolerance. J Med Chem57:3148-53 (2014) 
 
Mu-type opioid receptor
Name:Mu-type opioid receptor
Type:G Protein-Coupled Receptor (GPCR)
Mol. Mass.:44503.11
Organism:Rattus norvegicus (rat)
Description:Competition binding assays were carried out using membrane preparations from transfected HN9.10 cells that constitutively expressed the mu opioid receptor.
Residue:398
BDBM50001608
NameBDBM50001608
Synonyms:CHEMBL3237723
TypeSmall organic molecule
Emp. Form.C40H56N6O12S2
Mol. Mass.877.036
SMILESCc1cc(O)cc(C)c1C[C@H](N)C(=O)N[C@@H]1CSCCSC(C)(C)[C@@H](NC(=O)C2(Cc3ccccc3C2)NC1=O)C(=O)N[C@@H](CO[C@@H]1O[C@H](CO)[C@@H](O)[C@H](O)[C@H]1O)C(N)=O