Reaction Details
TargetKappa-type opioid receptor
LigandBDBM50001588
Substrate/Competitorn/a
Meas. Tech.ChEMBL_1336488 (CHEMBL3242765)
Ki 776±n/a nM
Citation Mosberg, HIYeomans, LAnand, JPPorter, VSobczyk-Kojiro, KTraynor, JRJutkiewicz, EM Development of a bioavailableµ opioid receptor (MOPr) agonist,d opioid receptor (DOPr) antagonist peptide that evokes antinociception without development of acute tolerance. J Med Chem57:3148-53 (2014) 
 
Kappa-type opioid receptor
Name:Kappa-type opioid receptor
Type:G Protein-Coupled Receptor (GPCR)
Mol. Mass.:42648.76
Organism:Homo sapiens (Human)
Description:P41145
Residue:380
BDBM50001588
NameBDBM50001588
Synonyms:CHEMBL3237720
TypeSmall organic molecule
Emp. Form.C31H40N4O6S2
Mol. Mass.628.803
SMILESCc1cc(O)cc(C)c1C[C@H](N)C(=O)N[C@@H]1CSCCSC(C)(C)[C@@H](NC(=O)C2(Cc3ccccc3C2)NC1=O)C(O)=O