Reaction Details
TargetCathepsin B
LigandBDBM50286441
Substrate/Competitorn/a
Meas. Tech.ChEMBL_1337276 (CHEMBL3240890)
Ki 0.02±n/a nM
Citation Raghav, NSingh, M Acyl hydrazides and triazoles as novel inhibitors of mammalian cathepsin B and cathepsin H. Eur J Med Chem77:231-42 (2014) 
 
Cathepsin B
Name:Cathepsin B
Synonyms:n/a
Type:Protein
Mol. Mass.:36777.57
Organism:Capra hircus (Goat)
Description:n/a
Residue:335
BDBM50286441
NameBDBM50286441
TypeSmall organic molecule
Emp. Form.C20H38N6O5
Mol. Mass.442.5529
SMILESCC(C)C[C@H](NC(C)=O)C(=O)N[C@@H](CC(C)C)C(=O)N[C@@H](CCCNC(N)=N)C(O)=O