Reaction Details
TargetNeuronal acetylcholine receptor subunit alpha-3/beta-4
LigandBDBM50001697
Substrate/Competitorn/a
Meas. Tech.ChEMBL_1337313 (CHEMBL3241175)
IC50 97±n/a nM
Citation Chang, YPBanerjee, JDowell, CWu, JGyanda, RHoughten, RAToll, LMcIntosh, JMArmishaw, CJ Discovery of a potent and selectivea3ß4 nicotinic acetylcholine receptor antagonist from ana-conotoxin synthetic combinatorial library. J Med Chem57:3511-21 (2014) 
 
Neuronal acetylcholine receptor subunit alpha-3/beta-4
Name:Neuronal acetylcholine receptor subunit alpha-3/beta-4
Type:n/a
Mol. Mass.:n/a
Description:ASSAY_ID of ChEMBL is 1970247
Components:This complex has 2 components.
Component 1
Name:Neuronal acetylcholine receptor subunit beta-4
Synonyms:ACHB4_HUMAN Cholinergic, Nicotinic Alpha6Beta3Beta4Alpha5 Nicotinic acetylcholine receptor alpha6/alpha3/beta4
Type:Enzyme Catalytic Domain
Mol. Mass.:56388.51
Organism:Homo sapiens (Human)
Description:Cholinergic, Nicotinic Alpha6Beta3Beta4Alpha5 0 HUMAN::P30926
Residue:498
Component 2
Name:Neuronal acetylcholine receptor subunit alpha-3
Synonyms:ACHA3_HUMAN Cholinergic, Nicotinic Alpha3Beta2 Cholinergic, Nicotinic Alpha3Beta4x NACHRA3 Neuronal acetylcholine receptor subunit alpha-3 nicotinic central
Type:Enzyme Catalytic Domain
Mol. Mass.:57479.03
Organism:Homo sapiens (Human)
Description:Cholinergic, Nicotinic Alpha3Beta2 0 HUMAN::P32297
Residue:505
BDBM50001697
NameBDBM50001697
Synonyms:CHEMBL3238027
TypeSmall organic molecule
Emp. Form.C65H97N23O21S4
Mol. Mass.1664.867
SMILES[H][C@@]12CCCN1C(=O)[C@H](Cc1cnc[nH]1)NC(=O)[C@H](CO)NC(=O)[C@]1([H])CSSC[C@H](NC(=O)[C@@]([H])(NC(=O)[C@H](Cc3cnc[nH]3)NC(=O)[C@]3([H])CCCN3C(=O)[C@H](CC(N)=O)NC(=O)[C@H](CC(N)=O)NC(=O)[C@@H](NC(=O)[C@H](CC(N)=O)NC(=O)[C@]([H])(CSSC[C@H](NC(=O)CN)C(=O)N1)NC(=O)[C@H](C)NC2=O)C(C)C)[C@@H](C)CC)C(O)=O