Reaction Details
TargetSerine/threonine-protein kinase Nek2
LigandBDBM50001733
Substrate/Competitorn/a
Meas. Tech.ChEMBL_1337317 (CHEMBL3241179)
IC50>10000±n/a nM
Citation Mahmoud, KAKrug, MWersig, TSlynko, ISchächtele, CTotzke, FSippl, WHilgeroth, A Discovery of 4-anilinoa-carbolines as novel Brk inhibitors. Bioorg Med Chem Lett24:1948-51 (2014) 
 
Serine/threonine-protein kinase Nek2
Name:Serine/threonine-protein kinase Nek2
Type:Enzyme
Mol. Mass.:51776.96
Organism:Homo sapiens (Human)
Description:P51955
Residue:445
BDBM50001733
NameBDBM50001733
Synonyms:CHEMBL3133821
TypeSmall organic molecule
Emp. Form.C17H13N3O
Mol. Mass.275.3046
SMILESOc1cccc(Nc2ccnc3[nH]c4ccccc4c23)c1