Reaction Details
TargetMAP kinase-activated protein kinase 3
LigandBDBM50001733
Substrate/Competitorn/a
Meas. Tech.ChEMBL_1337315 (CHEMBL3241177)
IC50>10000±n/a nM
Citation Mahmoud, KAKrug, MWersig, TSlynko, ISchächtele, CTotzke, FSippl, WHilgeroth, A Discovery of 4-anilinoa-carbolines as novel Brk inhibitors. Bioorg Med Chem Lett24:1948-51 (2014) 
 
MAP kinase-activated protein kinase 3
Name:MAP kinase-activated protein kinase 3
Type:Serine/threonine-protein kinase
Mol. Mass.:42991.57
Organism:Homo sapiens (Human)
Description:Recombinant MAPKAPK3 was phosphorylated by incubation with active p38alpha before assays.
Residue:382
BDBM50001733
NameBDBM50001733
Synonyms:CHEMBL3133821
TypeSmall organic molecule
Emp. Form.C17H13N3O
Mol. Mass.275.3046
SMILESOc1cccc(Nc2ccnc3[nH]c4ccccc4c23)c1