Reaction Details
TargetMAP kinase-activated protein kinase 5
LigandBDBM50001733
Substrate/Competitorn/a
Meas. Tech.ChEMBL_1337321 (CHEMBL3241183)
IC50>10000±n/a nM
Citation Mahmoud, KAKrug, MWersig, TSlynko, ISchächtele, CTotzke, FSippl, WHilgeroth, A Discovery of 4-anilinoa-carbolines as novel Brk inhibitors. Bioorg Med Chem Lett24:1948-51 (2014) 
 
MAP kinase-activated protein kinase 5
Name:MAP kinase-activated protein kinase 5
Type:Serine/threonine-protein kinase
Mol. Mass.:54229.92
Organism:Homo sapiens (Human)
Description:Recombinant MAPKAPK5 was phosphorylated by incubation with active p38alpha before assays.
Residue:473
BDBM50001733
NameBDBM50001733
Synonyms:CHEMBL3133821
TypeSmall organic molecule
Emp. Form.C17H13N3O
Mol. Mass.275.3046
SMILESOc1cccc(Nc2ccnc3[nH]c4ccccc4c23)c1