Reaction Details
TargetProtein-tyrosine kinase 6
LigandBDBM50001733
Substrate/Competitorn/a
Meas. Tech.ChEMBL_1337320 (CHEMBL3241182)
IC50 3.2±n/a nM
Citation Mahmoud, KAKrug, MWersig, TSlynko, ISchächtele, CTotzke, FSippl, WHilgeroth, A Discovery of 4-anilinoa-carbolines as novel Brk inhibitors. Bioorg Med Chem Lett24:1948-51 (2014) 
 
Protein-tyrosine kinase 6
Name:Protein-tyrosine kinase 6
Type:Tyrosine-protein kinase
Mol. Mass.:51839.11
Organism:Homo sapiens (Human)
Description:n/a
Residue:451
BDBM50001733
NameBDBM50001733
Synonyms:CHEMBL3133821
TypeSmall organic molecule
Emp. Form.C17H13N3O
Mol. Mass.275.3046
SMILESOc1cccc(Nc2ccnc3[nH]c4ccccc4c23)c1