Reaction Details
TargetProtein-tyrosine kinase 6
LigandBDBM50001734
Substrate/Competitorn/a
Meas. Tech.ChEMBL_1337320 (CHEMBL3241182)
IC50 4.4±n/a nM
Citation Mahmoud, KAKrug, MWersig, TSlynko, ISchächtele, CTotzke, FSippl, WHilgeroth, A Discovery of 4-anilinoa-carbolines as novel Brk inhibitors. Bioorg Med Chem Lett24:1948-51 (2014) 
 
Protein-tyrosine kinase 6
Name:Protein-tyrosine kinase 6
Type:Tyrosine-protein kinase
Mol. Mass.:51839.11
Organism:Homo sapiens (Human)
Description:n/a
Residue:451
BDBM50001734
NameBDBM50001734
Synonyms:CHEMBL3238103
TypeSmall organic molecule
Emp. Form.C18H14BrN3O
Mol. Mass.368.227
SMILESCOc1cc(Nc2ccnc3[nH]c4ccccc4c23)ccc1Br